[strongSwan-dev] compilation error with libreswan

Imran Akbar skunkwerk at gmail.com
Mon Dec 1 02:27:56 CET 2014

Hi everyone,

    thanks for developing a great software project.
I was trying to build the source, following these directions:

and I managed to get past the ./autogen.sh and ./configure steps.
When I do a 'make', though, I get the following error:

syntax error, unexpected identifier, expecting string
make[3]: *** [settings/settings_parser.c] Error 1
make[2]: *** [all-recursive] Error 1
make[1]: *** [all-recursive] Error 1
make: *** [all] Error 2

Any ideas how to fix this?

-------------- next part --------------
An HTML attachment was scrubbed...
URL: <http://lists.strongswan.org/pipermail/dev/attachments/20141130/86ee4b8b/attachment.html>

More information about the Dev mailing list